{"text_format":"1","workbook":"xlsx","n_sheets":3,"sheets":["報酬支給額証明書（出産手当金）","PS","変更履歴"],"not_rendered":{"charts":0,"images":0,"macros":1,"external_links":0,"defined_names":1,"comments":1,"pivot_tables":0},"unopened":[],"bounds":{"document_bytes":16777216,"sheet_cells":100000,"rows_first":2000,"rows_last":500,"rows_between":2000,"halvings":0,"cell_chars":16384,"cell_head_chars":4096},"cells_cut":0,"cells_raw":0,"read":"whole","date_system":"1900"}

{"sheet":"報酬支給額証明書（出産手当金）","index":0,"n_rows":47,"n_cols":27,"rows_kept":47,"cut":false,"hidden":false,"merged":[[13,12,13,14],[3,15,6,15],[11,3,11,7],[11,9,11,11],[11,12,11,14],[11,15,11,17],[11,18,11,20],[11,21,11,23],[12,9,12,11],[12,12,12,14],[9,12,9,14],[9,15,9,17],[9,18,9,20],[9,21,9,23],[10,3,10,7],[10,9,10,11],[10,12,10,14],[10,15,10,17],[10,18,10,20],[10,21,10,23],[35,3,35,5],[36,3,36,5],[37,3,37,5],[29,6,29,8],[30,6,30,8],[31,6,31,8],[32,6,32,8],[33,6,33,8],[34,6,34,8],[35,6,35,8],[36,6,36,8],[37,6,37,8],[28,3,28,5],[27,6,27,8],[28,6,28,8],[29,3,29,5],[30,3,30,5],[31,3,31,5],[32,3,32,5],[33,3,33,5],[34,3,34,5],[22,3,22,5],[46,3,46,8],[46,9,46,23],[5,18,5,22],[45,3,45,8],[45,9,45,11],[45,12,45,14],[45,15,45,17],[45,18,45,20],[45,21,45,23],[44,3,44,8],[44,9,44,11],[44,12,44,14],[44,15,44,17],[44,18,44,20],[44,21,44,23],[43,3,43,8],[43,9,43,11],[23,3,23,5],[24,3,24,5],[20,6,20,8],[21,6,21,8],[22,6,22,8],[23,6,23,8],[43,12,43,14],[43,15,43,17],[43,18,43,20],[43,21,43,23],[42,3,42,8],[42,9,42,11],[42,12,42,14],[42,15,42,17],[42,18,42,20],[42,21,42,23],[41,3,41,8],[41,9,41,11],[41,12,41,14],[41,15,41,17],[41,18,41,20],[41,21,41,23],[40,3,40,8],[40,9,40,11],[40,12,40,14],[40,15,40,17],[40,18,40,20],[40,21,40,23],[38,3,38,8],[38,9,38,11],[38,12,38,14],[38,15,38,17],[38,18,38,20],[38,21,38,23],[36,9,36,11],[36,12,36,14],[36,15,36,17],[36,18,36,20],[36,21,36,23],[37,9,37,11],[37,12,37,14],[37,15,37,17],[37,18,37,20],[37,21,37,23],[34,9,34,11],[34,12,34,14],[34,15,34,17],[34,18,34,20],[34,21,34,23],[35,9,35,11],[35,12,35,14],[35,15,35,17],[35,18,35,20],[35,21,35,23],[32,9,32,11],[32,12,32,14],[32,15,32,17],[32,18,32,20],[32,21,32,23],[33,9,33,11],[33,12,33,14],[33,15,33,17],[33,18,33,20],[33,21,33,23],[30,9,30,11],[30,12,30,14],[30,15,30,17],[30,18,30,20],[30,21,30,23],[31,9,31,11],[31,12,31,14],[31,15,31,17],[31,18,31,20],[31,21,31,23],[28,9,28,11],[28,12,28,14],[28,15,28,17],[28,18,28,20],[28,21,28,23],[29,9,29,11],[29,12,29,14],[29,15,29,17],[29,18,29,20],[29,21,29,23],[24,9,24,11],[24,12,24,14],[24,15,24,17],[24,18,24,20],[24,21,24,23],[26,3,26,8],[26,9,27,11],[26,12,27,14],[26,15,27,17],[26,18,27,20],[26,21,27,23],[25,3,25,8],[25,9,25,11],[25,12,25,14],[25,15,25,17],[25,18,25,20],[25,21,25,23],[24,6,24,8],[27,3,27,5],[22,9,22,11],[22,12,22,14],[22,15,22,17],[22,18,22,20],[22,21,22,23],[23,9,23,11],[23,12,23,14],[23,15,23,17],[23,18,23,20],[23,21,23,23],[19,3,19,8],[19,9,20,11],[19,12,20,14],[19,15,20,17],[19,18,20,20],[19,21,20,23],[21,9,21,11],[21,12,21,14],[21,15,21,17],[21,18,21,20],[21,21,21,23],[20,3,20,5],[21,3,21,5],[18,3,18,8],[18,9,18,11],[18,12,18,14],[18,15,18,17],[18,18,18,20],[18,21,18,23],[17,3,17,8],[17,9,17,11],[17,12,17,14],[17,15,17,17],[17,18,17,20],[17,21,17,23],[2,2,2,11],[3,18,3,23],[4,18,4,23],[16,3,16,8],[16,9,16,11],[16,12,16,14],[16,15,16,17],[16,18,16,20],[6,18,6,23],[15,3,15,8],[16,21,16,23],[5,3,5,5],[6,3,6,5],[5,6,5,11],[6,6,6,11],[8,3,8,7],[8,9,8,11],[8,12,8,14],[8,15,8,17],[8,18,8,20],[8,21,8,23],[9,3,9,7],[9,9,9,11],[13,9,13,11]]}
[]
[]
[null,null,"報酬支給額証明書（出産手当金）"]
[null,null,null,null,null,"年",null,"月","の給与報酬額について、下記のとおり証明します。",null,null,null,null,null,null,"証明者",null,"所属",""]
[null,null,null,null,"","年","","月","","日",null,null,null,null,null,null,null,"役職",""]
[null,null,null,"組合員番号",null,null,"",null,null,null,null,null,null,null,null,null,null,"氏名"]
[null,null,null,"組合員氏名",null,null,"",null,null,null,null,null,null,null,null,null,null,"連絡先",""]
[]
[null,null,null,"支給開始日",null,null,null,null,"",{"$f":"IF(D10=\"\",\"\",IF(EDATE($D$10,-11)>DATE(2015,9,30),EDATE($D$10,-11),\"標準報酬月額なし\"))","v":""},null,null,{"$f":"IF(D10=\"\",\"\",IF(EDATE($D$10,-10)>DATE(2015,9,30),EDATE($D$10,-10),\"標準報酬月額なし\"))","v":""},null,null,{"$f":"IF(D10=\"\",\"\",IF(EDATE($D$10,-9)>DATE(2015,9,30),EDATE($D$10,-9),\"標準報酬月額なし\"))","v":""},null,null,{"$f":"IF(D10=\"\",\"\",IF(EDATE($D$10,-8)>DATE(2015,9,30),EDATE($D$10,-8),\"標準報酬月額なし\"))","v":""},null,null,{"$f":"IF(D10=\"\",\"\",IF(EDATE($D$10,-7)>DATE(2015,9,30),EDATE($D$10,-7),\"標準報酬月額なし\"))","v":""},null,null,null,null,"・Tabキーで入力可能なセル間のカーソル移動が出来ます。"]
[null,null,null,null,null,null,null,null,""]
[null,null,null,"標準報酬月額の平均額",null,null,null,null,"",{"$f":"IF(D10=\"\",\"\",IF(EDATE($D$10,-6)>DATE(2015,9,30),EDATE($D$10,-6),\"標準報酬月額なし\"))","v":""},null,null,{"$f":"IF(D10=\"\",\"\",IF(EDATE($D$10,-5)>DATE(2015,9,30),EDATE($D$10,-5),\"標準報酬月額なし\"))","v":""},null,null,{"$f":"IF(D10=\"\",\"\",IF(EDATE($D$10,-4)>DATE(2015,9,30),EDATE($D$10,-4),\"標準報酬月額なし\"))","v":""},null,null,{"$f":"IF(D10=\"\",\"\",IF(EDATE($D$10,-3)>DATE(2015,9,30),EDATE($D$10,-3),\"標準報酬月額なし\"))","v":""},null,null,{"$f":"IF(D10=\"\",\"\",IF(EDATE($D$10,-2)>DATE(2015,9,30),EDATE($D$10,-2),\"標準報酬月額なし\"))","v":""}]
[null,null,null,{"$f":"IF(AND(M14=\"\",J14=\"\",V12=\"\",S12=\"\",P12=\"\",M12=\"\",J12=\"\",V10=\"\",S10=\"\",P10=\"\",M10=\"\",J10=\"\"),\"\",ROUND(AVERAGE(J14:O14,J12:X12,J10:X10),0))","v":""},null,null,null,null,""]
[null,null,null,null,null,null,"","","",{"$f":"IF(D10=\"\",\"\",IF(EDATE(D10,-1)>DATE(2015,9,30),EDATE(D10,-1),\"標準報酬月額なし\"))","v":""},null,null,{"$f":"IF(D10=\"\",\"\",IF(D10<DATE(2015,10,1),DATE(2015,10,1),D10))","v":""},null,null,null,null,null,null,null,null,null,null,null,null,null,"・入力内容をクリアします。"]
[null,null,null,null,null,null,"","","",null,null,null,null,null,null,null,null,null,"","","","","",""]
[null,null,null,null,null,null,null,null,null,null,null,null,null,null,null,null,null,null,null,null,null,null,null,{"$f":"IF(SUM(PS!H17:H20)=0,\"\",VLOOKUP(MAX(PS!H17:H20),PS!H17:I20,2))","v":""}]
[null,null,"①算定時基準額","期間 ",null,null,null,null,null,null,"～",null,null,"～",null,null,"～",null,null,"～",null,null,"～"]
[null,null,null,"要勤務日数 ",null,null,null,null,null,{"$f":"IF(OR(J16=\"\",L16=\"\",SUM(PS!M24:O26)<>0),\"\",NETWORKDAYS(J16,L16))","v":""},null,null,{"$f":"IF(OR(M16=\"\",O16=\"\",SUM(PS!P24:R26)<>0),\"\",NETWORKDAYS(M16,O16))","v":""},null,null,{"$f":"IF(OR(P16=\"\",R16=\"\",SUM(PS!S24:U26)<>0),\"\",NETWORKDAYS(P16,R16))","v":""},null,null,{"$f":"IF(OR(S16=\"\",U16=\"\",SUM(PS!V24:X26)<>0),\"\",NETWORKDAYS(S16,U16))","v":""},null,null,{"$f":"IF(OR(V16=\"\",X16=\"\",SUM(PS!Y24:AA26)<>0),\"\",NETWORKDAYS(V16,X16))","v":""},null,null,null,null,"・要勤務日数は自動で土日を除いた日数を計算しますが、"]
[null,null,"要勤務日数(合計)","勤務状態種別 ",null,null,null,null,null,null,null,null,null,null,null,null,null,null,null,null,null,null,null,null,null,null,"　土日を含めたい場合などは手入力モードに切り替えます。"]
[null,null,{"$f":"IF(SUM(J17:X17)=0,\"\",SUM(J17:X17))","v":""},"給与支給割合 ",null,null,null,null,null,null,null,null,null,null,null,null,null,null,null,null,null,null,null,null,null,null,"・手入力⇒自動に切り替える際、手入力内容は自動計算内容"]
[null,null,null,"本来の支給額",null,null,null,null,null,"支給実績",null,null,"支給実績",null,null,"支給実績",null,null,"支給実績",null,null,"支給実績",null,null,null,null,"　で上書きされます。"]
[null,null,null,"種別",null,null,"金額"]
[null,null,null,"基本給 ",null,null,null,null,null,{"$f":"IF(PS!M$22=\"\",\"\",ROUND(ROUNDDOWN($G22*J$19,0)*J$17/$C$19,2))","v":""},null,null,{"$f":"IF(PS!P$22=\"\",\"\",ROUND(ROUNDDOWN($G22*M$19,0)*M$17/$C$19,2))","v":""},null,null,{"$f":"IF(PS!S$22=\"\",\"\",ROUND(ROUNDDOWN($G22*P$19,0)*P$17/$C$19,2))","v":""},null,null,{"$f":"IF(PS!V$22=\"\",\"\",ROUND(ROUNDDOWN($G22*S$19,0)*S$17/$C$19,2))","v":""},null,null,{"$f":"IF(PS!Y$22=\"\",\"\",ROUND(ROUNDDOWN($G22*V$19,0)*V$17/$C$19,2))","v":""}]
[null,null,null,"調整額 ",null,null,null,null,null,{"$f":"IF(PS!M$22=\"\",\"\",ROUND(ROUNDDOWN($G23*J$19,0)*J$17/$C$19,2))","v":""},null,null,{"$f":"IF(PS!P$22=\"\",\"\",ROUND(ROUNDDOWN($G23*M$19,0)*M$17/$C$19,2))","v":""},null,null,{"$f":"IF(PS!S$22=\"\",\"\",ROUND(ROUNDDOWN($G23*P$19,0)*P$17/$C$19,2))","v":""},null,null,{"$f":"IF(PS!V$22=\"\",\"\",ROUND(ROUNDDOWN($G23*S$19,0)*S$17/$C$19,2))","v":""},null,null,{"$f":"IF(PS!Y$22=\"\",\"\",ROUND(ROUNDDOWN($G23*V$19,0)*V$17/$C$19,2))","v":""}]
[null,null,null,"地域手当 ",null,null,null,null,null,{"$f":"IF(PS!M$22=\"\",\"\",IF($G24=\"\",0,ROUND(ROUNDDOWN($G24*J$19,0)*J$17/$C$19,2)))","v":""},null,null,{"$f":"IF(PS!P$22=\"\",\"\",IF($G24=\"\",0,ROUND(ROUNDDOWN($G24*M$19,0)*M$17/$C$19,2)))","v":""},null,null,{"$f":"IF(PS!S$22=\"\",\"\",IF($G24=\"\",0,ROUND(ROUNDDOWN($G24*P$19,0)*P$17/$C$19,2)))","v":""},null,null,{"$f":"IF(PS!V$22=\"\",\"\",IF($G24=\"\",0,ROUND(ROUNDDOWN($G24*S$19,0)*S$17/$C$19,2)))","v":""},null,null,{"$f":"IF(PS!Y$22=\"\",\"\",IF($G24=\"\",0,ROUND(ROUNDDOWN($G24*V$19,0)*V$17/$C$19,2)))","v":""}]
[null,null,null,"合計",null,null,{"$f":"IF(SUM(G22:I24)=0,\"\",SUM(G22:I24))","v":""},null,null,{"$f":"IF(PS!M$22=\"\",\"\",ROUNDDOWN(SUM(J22:L24),0))","v":""},null,null,{"$f":"IF(PS!P$22=\"\",\"\",ROUNDDOWN(SUM(M22:O24),0))","v":""},null,null,{"$f":"IF(PS!S$22=\"\",\"\",ROUNDDOWN(SUM(P22:R24),0))","v":""},null,null,{"$f":"IF(PS!V$22=\"\",\"\",ROUNDDOWN(SUM(S22:U24),0))","v":""},null,null,{"$f":"IF(PS!Y$22=\"\",\"\",ROUNDDOWN(SUM(V22:X24),0))","v":""}]
[null,null,null,"②日額_ \n(合計÷要勤務日数、小数点第3位四捨五入)",null,null,null,null,null,{"$f":"IF(PS!M$22=\"\",\"\",IF(J17=0,0,ROUND(J25/J17,2)))","v":""},null,null,{"$f":"IF(PS!P$22=\"\",\"\",IF(M17=0,0,ROUND(M25/M17,2)))","v":""},null,null,{"$f":"IF(PS!S$22=\"\",\"\",IF(P17=0,0,ROUND(P25/P17,2)))","v":""},null,null,{"$f":"IF(PS!V$22=\"\",\"\",IF(S17=0,0,ROUND(S25/S17,2)))","v":""},null,null,{"$f":"IF(PS!Y$22=\"\",\"\",IF(V17=0,0,ROUND(V25/V17,2)))","v":""}]
[null,null,null,"本来の支給額"]
[null,null,null,"種別",null,null,"金額"]
[null,null,null,"扶養手当 ",null,null,null,null,null,{"$f":"IF(PS!M$22=\"\",\"\",IF(J$17=0,0,ROUNDDOWN($G29*J$19,0)))","v":""},null,null,{"$f":"IF(PS!P$22=\"\",\"\",IF(M$17=0,0,ROUNDDOWN($G29*M$19,0)))","v":""},null,null,{"$f":"IF(PS!S$22=\"\",\"\",IF(P$17=0,0,ROUNDDOWN($G29*P$19,0)))","v":""},null,null,{"$f":"IF(PS!V$22=\"\",\"\",IF(S$17=0,0,ROUNDDOWN($G29*S$19,0)))","v":""},null,null,{"$f":"IF(PS!Y$22=\"\",\"\",IF(V$17=0,0,ROUNDDOWN($G29*V$19,0)))","v":""}]
[null,null,null,"住居手当 ",null,null,null,null,null,{"$f":"IF(PS!M$22=\"\",\"\",IF(J$17=0,0,ROUNDDOWN($G30*J$19,0)))","v":""},null,null,{"$f":"IF(PS!P$22=\"\",\"\",IF(M$17=0,0,ROUNDDOWN($G30*M$19,0)))","v":""},null,null,{"$f":"IF(PS!S$22=\"\",\"\",IF(P$17=0,0,ROUNDDOWN($G30*P$19,0)))","v":""},null,null,{"$f":"IF(PS!V$22=\"\",\"\",IF(S$17=0,0,ROUNDDOWN($G30*S$19,0)))","v":""},null,null,{"$f":"IF(PS!Y$22=\"\",\"\",IF(V$17=0,0,ROUNDDOWN($G30*V$19,0)))","v":""}]
[null,null,null,"管理職手当 ",null,null,null,null,null,{"$f":"IF(PS!M$22=\"\",\"\",IF(J$17=0,0,IF(PS!$AB$23,$G31,0)))","v":""},null,null,{"$f":"IF(PS!P$22=\"\",\"\",IF(M$17=0,0,IF(PS!$AB$23,$G31,0)))","v":""},null,null,{"$f":"IF(PS!S$22=\"\",\"\",IF(P$17=0,0,IF(PS!$AB$23,$G31,0)))","v":""},null,null,{"$f":"IF(PS!V$22=\"\",\"\",IF(S$17=0,0,IF(PS!$AB$23,$G31,0)))","v":""},null,null,{"$f":"IF(PS!Y$22=\"\",\"\",IF(V$17=0,0,IF(PS!$AB$23,$G31,0)))","v":""}]
[null,null,null,"通勤手当 ",null,null,null,null,null,{"$f":"IF(PS!M$22=\"\",\"\",IF(OR(J$17=0,J$18=PS!$B$21,NOT(PS!$AB$23)),0,$G32))","v":""},null,null,{"$f":"IF(PS!P$22=\"\",\"\",IF(OR(M$17=0,M$18=PS!$B$21,NOT(PS!$AB$23)),0,$G32))","v":""},null,null,{"$f":"IF(PS!S$22=\"\",\"\",IF(OR(P$17=0,P$18=PS!$B$21,NOT(PS!$AB$23)),0,$G32))","v":""},null,null,{"$f":"IF(PS!V$22=\"\",\"\",IF(OR(S$17=0,S$18=PS!$B$21,NOT(PS!$AB$23)),0,$G32))","v":""},null,null,{"$f":"IF(PS!Y$22=\"\",\"\",IF(OR(V$17=0,V$18=PS!$B$21,NOT(PS!$AB$23)),0,$G32))","v":""}]
[null,null,null,"単身赴任手当 ",null,null,null,null,null,{"$f":"IF(PS!M$22=\"\",\"\",IF(OR(J$17=0,J$18=PS!$B$21),0,$G33))","v":""},null,null,{"$f":"IF(PS!P$22=\"\",\"\",IF(OR(M$17=0,M$18=PS!$B$21),0,$G33))","v":""},null,null,{"$f":"IF(PS!S$22=\"\",\"\",IF(OR(P$17=0,P$18=PS!$B$21),0,$G33))","v":""},null,null,{"$f":"IF(PS!V$22=\"\",\"\",IF(OR(S$17=0,S$18=PS!$B$21),0,$G33))","v":""},null,null,{"$f":"IF(PS!Y$22=\"\",\"\",IF(OR(V$17=0,V$18=PS!$B$21),0,$G33))","v":""}]
[null,null,null,"超過勤務手当 ",null,null,null,null,null,{"$f":"IF(PS!M$22=\"\",\"\",0)","v":""},null,null,{"$f":"IF(PS!P$22=\"\",\"\",0)","v":""},null,null,{"$f":"IF(PS!S$22=\"\",\"\",0)","v":""},null,null,{"$f":"IF(PS!V$22=\"\",\"\",0)","v":""},null,null,{"$f":"IF(PS!Y$22=\"\",\"\",0)","v":""}]
[null,null,null,"特殊勤務手当 ",null,null,null,null,null,{"$f":"IF(PS!M$22=\"\",\"\",0)","v":""},null,null,{"$f":"IF(PS!P$22=\"\",\"\",0)","v":""},null,null,{"$f":"IF(PS!S$22=\"\",\"\",0)","v":""},null,null,{"$f":"IF(PS!V$22=\"\",\"\",0)","v":""},null,null,{"$f":"IF(PS!Y$22=\"\",\"\",0)","v":""}]
[null,null,null,"休日給 ",null,null,null,null,null,{"$f":"IF(PS!M$22=\"\",\"\",0)","v":""},null,null,{"$f":"IF(PS!P$22=\"\",\"\",0)","v":""},null,null,{"$f":"IF(PS!S$22=\"\",\"\",0)","v":""},null,null,{"$f":"IF(PS!V$22=\"\",\"\",0)","v":""},null,null,{"$f":"IF(PS!Y$22=\"\",\"\",0)","v":""}]
[null,null,null,"その他 ",null,null,null,null,null,{"$f":"IF(PS!M$22=\"\",\"\",0)","v":""},null,null,{"$f":"IF(PS!P$22=\"\",\"\",0)","v":""},null,null,{"$f":"IF(PS!S$22=\"\",\"\",0)","v":""},null,null,{"$f":"IF(PS!V$22=\"\",\"\",0)","v":""},null,null,{"$f":"IF(PS!Y$22=\"\",\"\",0)","v":""}]
[null,null,null,"合計",null,null,{"$f":"IF(SUM(G29:I37)=0,\"\",SUM(G29:I37))","v":""},null,null,{"$f":"IF(PS!M$22=\"\",\"\",SUM(J29:L37))","v":""},null,null,{"$f":"IF(PS!P$22=\"\",\"\",SUM(M29:O37))","v":""},null,null,{"$f":"IF(PS!S$22=\"\",\"\",SUM(P29:R37))","v":""},null,null,{"$f":"IF(PS!V$22=\"\",\"\",SUM(S29:U37))","v":""},null,null,{"$f":"IF(PS!Y$22=\"\",\"\",SUM(V29:X37))","v":""}]
[null,null,null,"③日額_\n(合計÷２２、小数点第3位四捨五入)",null,null,null,null,null,{"$f":"IF(PS!M$22=\"\",\"\",ROUND(J38/22,2))","v":""},null,null,{"$f":"IF(PS!P$22=\"\",\"\",ROUND(M38/22,2))","v":""},null,null,{"$f":"IF(PS!S$22=\"\",\"\",ROUND(P38/22,2))","v":""},null,null,{"$f":"IF(PS!V$22=\"\",\"\",ROUND(S38/22,2))","v":""},null,null,{"$f":"IF(PS!Y$22=\"\",\"\",ROUND(V38/22,2))","v":""}]
[]
{"$rows_left_out":8}
{"sheet":"PS","index":1,"n_rows":23,"n_cols":28,"rows_kept":23,"cut":false,"hidden":true,"merged":[[20,24,20,26],[21,10,21,11],[21,12,21,14],[21,15,21,17],[21,18,21,20],[21,21,21,23],[21,24,21,26],[20,10,20,11],[20,12,20,14],[16,10,16,11],[20,15,20,17],[20,18,20,20],[20,21,20,23],[17,10,17,11],[18,10,18,11],[19,10,19,11],[22,24,22,26],[22,10,22,11],[22,12,22,14],[22,15,22,17],[22,18,22,20],[22,21,22,23]]}
[]
[null,"注：当ツールを配布する際、このシートは非表示としてください。"]
[]
[]
[]
[]
[null,"【ブックの構成】"]
[null,"・シート「報酬支給額証明書（出産手当金）」"]
[null,"　⇒ ツールのメインシート。"]
[null,"・シート「PS」"]
[null,"　⇒　当シート、メインシートで使用する各種パラメータ用シート、入力チェック結果を保持。通常は非表示とする。"]
[null,"・シート「変更履歴」"]
[null,"　⇒　変更履歴を保持。"]
[]
[]
[null,"【勤務状態種別】","【支給無区分】","【勤務有無】",null,"【給与支給割合】",null,"【エラーメッセージ】",null,null,"【入力内容のチェック】"]
[null,"通常勤務",true,true,null,1,null,{"$f":"IF(SUM(M18:AA18)=0,\"\",1)","v":""},"期間入力エラー：期間の入力順序が正しくありません。",null,null,null,"１（自）",null,"１（至）","２（自）",null,"２（至）","３（自）",null,"３（至）","４（自）",null,"４（至）","５（自）",null,"５（至）"]
[null,"年次有給休暇",false,false,null,0.8,null,{"$f":"IF(SUM(M19:AA19)=0,\"\",2)","v":""},"期間入力エラー：期間が重複しています。",null,"期間並びチェック",null,{"$f":"IF('報酬支給額証明書（出産手当金）'!J16=\"\",0,IF(RANK('報酬支給額証明書（出産手当金）'!J16,'報酬支給額証明書（出産手当金）'!$J$16:J16)=1,0,1))","v":0},null,{"$f":"IF('報酬支給額証明書（出産手当金）'!L16=\"\",0,IF(RANK('報酬支給額証明書（出産手当金）'!L16,'報酬支給額証明書（出産手当金）'!$J$16:L16)=1,0,1))","v":0},{"$f":"IF('報酬支給額証明書（出産手当金）'!M16=\"\",0,IF(RANK('報酬支給額証明書（出産手当金）'!M16,'報酬支給額証明書（出産手当金）'!$J$16:M16)=1,0,1))","v":0},null,{"$f":"IF('報酬支給額証明書（出産手当金）'!O16=\"\",0,IF(RANK('報酬支給額証明書（出産手当金）'!O16,'報酬支給額証明書（出産手当金）'!$J$16:O16)=1,0,1))","v":0},{"$f":"IF('報酬支給額証明書（出産手当金）'!P16=\"\",0,IF(RANK('報酬支給額証明書（出産手当金）'!P16,'報酬支給額証明書（出産手当金）'!$J$16:P16)=1,0,1))","v":0},null,{"$f":"IF('報酬支給額証明書（出産手当金）'!R16=\"\",0,IF(RANK('報酬支給額証明書（出産手当金）'!R16,'報酬支給額証明書（出産手当金）'!$J$16:R16)=1,0,1))","v":0},{"$f":"IF('報酬支給額証明書（出産手当金）'!S16=\"\",0,IF(RANK('報酬支給額証明書（出産手当金）'!S16,'報酬支給額証明書（出産手当金）'!$J$16:S16)=1,0,1))","v":0},null,{"$f":"IF('報酬支給額証明書（出産手当金）'!U16=\"\",0,IF(RANK('報酬支給額証明書（出産手当金）'!U16,'報酬支給額証明書（出産手当金）'!$J$16:U16)=1,0,1))","v":0},{"$f":"IF('報酬支給額証明書（出産手当金）'!V16=\"\",0,IF(RANK('報酬支給額証明書（出産手当金）'!V16,'報酬支給額証明書（出産手当金）'!$J$16:V16)=1,0,1))","v":0},null,{"$f":"IF('報酬支給額証明書（出産手当金）'!X16=\"\",0,IF(RANK('報酬支給額証明書（出産手当金）'!X16,'報酬支給額証明書（出産手当金）'!$J$16:X16)=1,0,1))","v":0}]
[null,"妊娠出産休暇",false,false,null,0,null,{"$f":"IF(SUM(M20:AA20)=0,\"\",3)","v":""},"期間入力エラー：異なる月が入力されています。",null,"期間重複チェック",null,{"$f":"COUNTIF('報酬支給額証明書（出産手当金）'!M16:X16,'報酬支給額証明書（出産手当金）'!J16)","v":0},null,{"$f":"COUNTIF('報酬支給額証明書（出産手当金）'!M16:X16,'報酬支給額証明書（出産手当金）'!L16)","v":0},{"$f":"COUNTIF('報酬支給額証明書（出産手当金）'!J16:L16,'報酬支給額証明書（出産手当金）'!M16)+COUNTIF('報酬支給額証明書（出産手当金）'!P16:X16,'報酬支給額証明書（出産手当金）'!M16)","v":0},null,{"$f":"COUNTIF('報酬支給額証明書（出産手当金）'!J16:L16,'報酬支給額証明書（出産手当金）'!O16)+COUNTIF('報酬支給額証明書（出産手当金）'!P16:X16,'報酬支給額証明書（出産手当金）'!O16)","v":0},{"$f":"COUNTIF('報酬支給額証明書（出産手当金）'!J16:O16,'報酬支給額証明書（出産手当金）'!P16)+COUNTIF('報酬支給額証明書（出産手当金）'!S16:X16,'報酬支給額証明書（出産手当金）'!P16)","v":0},null,{"$f":"COUNTIF('報酬支給額証明書（出産手当金）'!J16:O16,'報酬支給額証明書（出産手当金）'!R16)+COUNTIF('報酬支給額証明書（出産手当金）'!S16:X16,'報酬支給額証明書（出産手当金）'!R16)","v":0},{"$f":"COUNTIF('報酬支給額証明書（出産手当金）'!J16:R16,'報酬支給額証明書（出産手当金）'!S16)+COUNTIF('報酬支給額証明書（出産手当金）'!V16:X16,'報酬支給額証明書（出産手当金）'!S16)","v":0},null,{"$f":"COUNTIF('報酬支給額証明書（出産手当金）'!J16:R16,'報酬支給額証明書（出産手当金）'!U16)+COUNTIF('報酬支給額証明書（出産手当金）'!V16:X16,'報酬支給額証明書（出産手当金）'!U16)","v":0},{"$f":"COUNTIF('報酬支給額証明書（出産手当金）'!J16:U16,'報酬支給額証明書（出産手当金）'!V16)","v":0},null,{"$f":"COUNTIF('報酬支給額証明書（出産手当金）'!J16:U16,'報酬支給額証明書（出産手当金）'!X16)","v":0}]
[null,"病気休暇",false,false,null,null,null,{"$f":"IF(SUM(M21:AA21)=0,\"\",4)","v":""},"要出勤日数入力エラー：入力期間(自)～(至)間の日数を超えています。",null,"同月チェック",null,{"$f":"IF('報酬支給額証明書（出産手当金）'!J16=\"\",0,IF(YEAR(MIN('報酬支給額証明書（出産手当金）'!$J$16:$X$16))&MONTH(MIN('報酬支給額証明書（出産手当金）'!$J$16:$X$16))=YEAR(MAX('報酬支給額証明書（出産手当金）'!$J$16:$X$16))&MONTH(MAX('報酬支給額証明書（出産手当金）'!$J$16:$X$16)),0,IF(YEAR('報酬支給額証明書（出産手当金）'!J16)&MONTH('報酬支給額証明書（出産手当金）'!J16)=YEAR(MIN('報酬支給額証明書（出産手当金）'!$J$16:$X$16))&MONTH(MIN('報酬支給額証明書（出産手当金）'!$J$16:$X$16)),0,1)))","v":0},null,{"$f":"IF('報酬支給額証明書（出産手当金）'!L16=\"\",0,IF(YEAR(MIN('報酬支給額証明書（出産手当金）'!$J$16:$X$16))&MONTH(MIN('報酬支給額証明書（出産手当金）'!$J$16:$X$16))=YEAR(MAX('報酬支給額証明書（出産手当金）'!$J$16:$X$16))&MONTH(MAX('報酬支給額証明書（出産手当金）'!$J$16:$X$16)),0,IF(YEAR('報酬支給額証明書（出産手当金）'!L16)&MONTH('報酬支給額証明書（出産手当金）'!L16)=YEAR(MIN('報酬支給額証明書（出産手当金）'!$J$16:$X$16))&MONTH(MIN('報酬支給額証明書（出産手当金）'!$J$16:$X$16)),0,1)))","v":0},{"$f":"IF('報酬支給額証明書（出産手当金）'!M16=\"\",0,IF(YEAR(MIN('報酬支給額証明書（出産手当金）'!$J$16:$X$16))&MONTH(MIN('報酬支給額証明書（出産手当金）'!$J$16:$X$16))=YEAR(MAX('報酬支給額証明書（出産手当金）'!$J$16:$X$16))&MONTH(MAX('報酬支給額証明書（出産手当金）'!$J$16:$X$16)),0,IF(YEAR('報酬支給額証明書（出産手当金）'!M16)&MONTH('報酬支給額証明書（出産手当金）'!M16)=YEAR(MIN('報酬支給額証明書（出産手当金）'!$J$16:$X$16))&MONTH(MIN('報酬支給額証明書（出産手当金）'!$J$16:$X$16)),0,1)))","v":0},null,{"$f":"IF('報酬支給額証明書（出産手当金）'!O16=\"\",0,IF(YEAR(MIN('報酬支給額証明書（出産手当金）'!$J$16:$X$16))&MONTH(MIN('報酬支給額証明書（出産手当金）'!$J$16:$X$16))=YEAR(MAX('報酬支給額証明書（出産手当金）'!$J$16:$X$16))&MONTH(MAX('報酬支給額証明書（出産手当金）'!$J$16:$X$16)),0,IF(YEAR('報酬支給額証明書（出産手当金）'!O16)&MONTH('報酬支給額証明書（出産手当金）'!O16)=YEAR(MIN('報酬支給額証明書（出産手当金）'!$J$16:$X$16))&MONTH(MIN('報酬支給額証明書（出産手当金）'!$J$16:$X$16)),0,1)))","v":0},{"$f":"IF('報酬支給額証明書（出産手当金）'!P16=\"\",0,IF(YEAR(MIN('報酬支給額証明書（出産手当金）'!$J$16:$X$16))&MONTH(MIN('報酬支給額証明書（出産手当金）'!$J$16:$X$16))=YEAR(MAX('報酬支給額証明書（出産手当金）'!$J$16:$X$16))&MONTH(MAX('報酬支給額証明書（出産手当金）'!$J$16:$X$16)),0,IF(YEAR('報酬支給額証明書（出産手当金）'!P16)&MONTH('報酬支給額証明書（出産手当金）'!P16)=YEAR(MIN('報酬支給額証明書（出産手当金）'!$J$16:$X$16))&MONTH(MIN('報酬支給額証明書（出産手当金）'!$J$16:$X$16)),0,1)))","v":0},null,{"$f":"IF('報酬支給額証明書（出産手当金）'!R16=\"\",0,IF(YEAR(MIN('報酬支給額証明書（出産手当金）'!$J$16:$X$16))&MONTH(MIN('報酬支給額証明書（出産手当金）'!$J$16:$X$16))=YEAR(MAX('報酬支給額証明書（出産手当金）'!$J$16:$X$16))&MONTH(MAX('報酬支給額証明書（出産手当金）'!$J$16:$X$16)),0,IF(YEAR('報酬支給額証明書（出産手当金）'!R16)&MONTH('報酬支給額証明書（出産手当金）'!R16)=YEAR(MIN('報酬支給額証明書（出産手当金）'!$J$16:$X$16))&MONTH(MIN('報酬支給額証明書（出産手当金）'!$J$16:$X$16)),0,1)))","v":0},{"$f":"IF('報酬支給額証明書（出産手当金）'!S16=\"\",0,IF(YEAR(MIN('報酬支給額証明書（出産手当金）'!$J$16:$X$16))&MONTH(MIN('報酬支給額証明書（出産手当金）'!$J$16:$X$16))=YEAR(MAX('報酬支給額証明書（出産手当金）'!$J$16:$X$16))&MONTH(MAX('報酬支給額証明書（出産手当金）'!$J$16:$X$16)),0,IF(YEAR('報酬支給額証明書（出産手当金）'!S16)&MONTH('報酬支給額証明書（出産手当金）'!S16)=YEAR(MIN('報酬支給額証明書（出産手当金）'!$J$16:$X$16))&MONTH(MIN('報酬支給額証明書（出産手当金）'!$J$16:$X$16)),0,1)))","v":0},null,{"$f":"IF('報酬支給額証明書（出産手当金）'!U16=\"\",0,IF(YEAR(MIN('報酬支給額証明書（出産手当金）'!$J$16:$X$16))&MONTH(MIN('報酬支給額証明書（出産手当金）'!$J$16:$X$16))=YEAR(MAX('報酬支給額証明書（出産手当金）'!$J$16:$X$16))&MONTH(MAX('報酬支給額証明書（出産手当金）'!$J$16:$X$16)),0,IF(YEAR('報酬支給額証明書（出産手当金）'!U16)&MONTH('報酬支給額証明書（出産手当金）'!U16)=YEAR(MIN('報酬支給額証明書（出産手当金）'!$J$16:$X$16))&MONTH(MIN('報酬支給額証明書（出産手当金）'!$J$16:$X$16)),0,1)))","v":0},{"$f":"IF('報酬支給額証明書（出産手当金）'!V16=\"\",0,IF(YEAR(MIN('報酬支給額証明書（出産手当金）'!$J$16:$X$16))&MONTH(MIN('報酬支給額証明書（出産手当金）'!$J$16:$X$16))=YEAR(MAX('報酬支給額証明書（出産手当金）'!$J$16:$X$16))&MONTH(MAX('報酬支給額証明書（出産手当金）'!$J$16:$X$16)),0,IF(YEAR('報酬支給額証明書（出産手当金）'!V16)&MONTH('報酬支給額証明書（出産手当金）'!V16)=YEAR(MIN('報酬支給額証明書（出産手当金）'!$J$16:$X$16))&MONTH(MIN('報酬支給額証明書（出産手当金）'!$J$16:$X$16)),0,1)))","v":0},null,{"$f":"IF('報酬支給額証明書（出産手当金）'!X16=\"\",0,IF(YEAR(MIN('報酬支給額証明書（出産手当金）'!$J$16:$X$16))&MONTH(MIN('報酬支給額証明書（出産手当金）'!$J$16:$X$16))=YEAR(MAX('報酬支給額証明書（出産手当金）'!$J$16:$X$16))&MONTH(MAX('報酬支給額証明書（出産手当金）'!$J$16:$X$16)),0,IF(YEAR('報酬支給額証明書（出産手当金）'!X16)&MONTH('報酬支給額証明書（出産手当金）'!X16)=YEAR(MIN('報酬支給額証明書（出産手当金）'!$J$16:$X$16))&MONTH(MIN('報酬支給額証明書（出産手当金）'!$J$16:$X$16)),0,1)))","v":0}]
[null,"病気休職",false,false,null,null,null,null,null,null,"手入力日数チェック",null,{"$f":"IF(OR('報酬支給額証明書（出産手当金）'!J16=\"\",'報酬支給額証明書（出産手当金）'!L16=\"\",'報酬支給額証明書（出産手当金）'!J17=\"\"),\"\",IF('報酬支給額証明書（出産手当金）'!L16-('報酬支給額証明書（出産手当金）'!J16-1)>='報酬支給額証明書（出産手当金）'!J17,0,1))","v":""},null,null,{"$f":"IF(OR('報酬支給額証明書（出産手当金）'!M16=\"\",'報酬支給額証明書（出産手当金）'!O16=\"\",'報酬支給額証明書（出産手当金）'!M17=\"\"),\"\",IF('報酬支給額証明書（出産手当金）'!O16-('報酬支給額証明書（出産手当金）'!M16-1)>='報酬支給額証明書（出産手当金）'!M17,0,1))","v":""},null,null,{"$f":"IF(OR('報酬支給額証明書（出産手当金）'!P16=\"\",'報酬支給額証明書（出産手当金）'!R16=\"\",'報酬支給額証明書（出産手当金）'!P17=\"\"),\"\",IF('報酬支給額証明書（出産手当金）'!R16-('報酬支給額証明書（出産手当金）'!P16-1)>='報酬支給額証明書（出産手当金）'!P17,0,1))","v":""},null,null,{"$f":"IF(OR('報酬支給額証明書（出産手当金）'!S16=\"\",'報酬支給額証明書（出産手当金）'!U16=\"\",'報酬支給額証明書（出産手当金）'!S17=\"\"),\"\",IF('報酬支給額証明書（出産手当金）'!U16-('報酬支給額証明書（出産手当金）'!S16-1)>='報酬支給額証明書（出産手当金）'!S17,0,1))","v":""},null,null,{"$f":"IF(OR('報酬支給額証明書（出産手当金）'!V16=\"\",'報酬支給額証明書（出産手当金）'!X16=\"\",'報酬支給額証明書（出産手当金）'!V17=\"\"),\"\",IF('報酬支給額証明書（出産手当金）'!X16-('報酬支給額証明書（出産手当金）'!V16-1)>='報酬支給額証明書（出産手当金）'!V17,0,1))","v":""}]
[null,"育児休業",true,false,null,null,null,null,null,null,"入力チェック",null,{"$f":"IF(OR('報酬支給額証明書（出産手当金）'!J17=\"\",'報酬支給額証明書（出産手当金）'!J18=\"\",'報酬支給額証明書（出産手当金）'!J19=\"\"),\"\",\"OK\")","v":""},null,null,{"$f":"IF(OR('報酬支給額証明書（出産手当金）'!M17=\"\",'報酬支給額証明書（出産手当金）'!M18=\"\",'報酬支給額証明書（出産手当金）'!M19=\"\"),\"\",\"OK\")","v":""},null,null,{"$f":"IF(OR('報酬支給額証明書（出産手当金）'!P17=\"\",'報酬支給額証明書（出産手当金）'!P18=\"\",'報酬支給額証明書（出産手当金）'!P19=\"\"),\"\",\"OK\")","v":""},null,null,{"$f":"IF(OR('報酬支給額証明書（出産手当金）'!S17=\"\",'報酬支給額証明書（出産手当金）'!S18=\"\",'報酬支給額証明書（出産手当金）'!S19=\"\"),\"\",\"OK\")","v":""},null,null,{"$f":"IF(OR('報酬支給額証明書（出産手当金）'!V17=\"\",'報酬支給額証明書（出産手当金）'!V18=\"\",'報酬支給額証明書（出産手当金）'!V19=\"\"),\"\",\"OK\")","v":""}]
[null,"その他",false,false,null,null,null,null,null,null,"勤務状況種別判定",null,{"$f":"IF('報酬支給額証明書（出産手当金）'!J18=\"\",\"\",VLOOKUP('報酬支給額証明書（出産手当金）'!J18,$B$17:$D$24,3,FALSE))","v":""},null,null,{"$f":"IF('報酬支給額証明書（出産手当金）'!M18=\"\",\"\",VLOOKUP('報酬支給額証明書（出産手当金）'!M18,$B$17:$D$24,3,FALSE))","v":""},null,null,{"$f":"IF('報酬支給額証明書（出産手当金）'!P18=\"\",\"\",VLOOKUP('報酬支給額証明書（出産手当金）'!P18,$B$17:$D$24,3,FALSE))","v":""},null,null,{"$f":"IF('報酬支給額証明書（出産手当金）'!S18=\"\",\"\",VLOOKUP('報酬支給額証明書（出産手当金）'!S18,$B$17:$D$24,3,FALSE))","v":""},null,null,{"$f":"IF('報酬支給額証明書（出産手当金）'!V18=\"\",\"\",VLOOKUP('報酬支給額証明書（出産手当金）'!V18,$B$17:$D$24,3,FALSE))","v":""},null,null,{"$f":"IF(AND(M23=\"\",P23=\"\",S23=\"\",V23=\"\",Y23=\"\"),\"\",OR(M23,P23,S23,V23,Y23))","v":""}]

{"sheet":"変更履歴","index":2,"n_rows":5,"n_cols":4,"rows_kept":5,"cut":false,"hidden":false,"merged":[]}
["バージョン","変更日付","変更内容","備考"]
[1,"2015-10-01","新規作成","作成環境 OS:Windows7、Office:2010"]
[2,"2016-04-01","支給開始日直近の最大12ヶ月分の標準報酬月額入力欄を追加"]
[2.1,"2019-06-18","見出しの日付から元号(平成)を削除"]
[2.2000000000000002,"2023-07-04","証明者の印欄を削除\n地域手当を手入力欄に変更"]